Problem parsing with the new gatsby-plugin-image

I have a parsing problem in gatsy using the new gatsy-plugin-image and gatsby-transformer-sharp
netlify site name : goofy-austin-25a016 domaine : https://www.nowmo.design

The build build log :

11:16:02 PM: Build ready to start
11:16:04 PM: build-image version: 195fbe127e5c374d9c4758652cb62e3b8936a395 (focal)
11:16:04 PM: build-image tag: v4.6.0
11:16:04 PM: buildbot version: 4ac77ee15240cafa5a14a04b6ca18d8959fa98e6
11:16:04 PM: Fetching cached dependencies
11:16:04 PM: Starting to download cache of 281.2MB
11:16:07 PM: Finished downloading cache in 2.96737704s
11:16:07 PM: Starting to extract cache
11:16:15 PM: Finished extracting cache in 7.608572788s
11:16:15 PM: Finished fetching cache in 10.601205622s
11:16:15 PM: Starting to prepare the repo for build
11:16:15 PM: Preparing Git Reference refs/heads/main
11:16:15 PM: Parsing package.json dependencies
11:16:16 PM: Starting build script
11:16:16 PM: Installing dependencies
11:16:16 PM: Python version set to 2.7
11:16:17 PM: Started restoring cached node version
11:16:18 PM: Finished restoring cached node version
11:16:18 PM: v16.14.2 is already installed.
11:16:18 PM: Now using node v16.14.2 (npm v8.5.0)
11:16:18 PM: Started restoring cached build plugins
11:16:18 PM: Finished restoring cached build plugins
11:16:18 PM: Attempting ruby version 2.7.2, read from environment
11:16:19 PM: Using ruby version 2.7.2
11:16:20 PM: Using PHP version 8.0
11:16:20 PM: Started restoring cached node modules
11:16:20 PM: Finished restoring cached node modules
11:16:20 PM: Installing NPM modules using NPM version 8.5.0
11:16:31 PM: npm WARN deprecated gatsby-image@3.11.0: gatsby-image is now gatsby-plugin-image: https://npm.im/gatsby-plugin-image. This package will no longer receive updates.
11:16:35 PM: added 57 packages, and audited 1814 packages in 15s
11:16:35 PM: 215 packages are looking for funding
11:16:35 PM:   run `npm fund` for details
11:16:36 PM: 34 vulnerabilities (9 moderate, 25 high)
11:16:36 PM: To address issues that do not require attention, run:
11:16:36 PM:   npm audit fix
11:16:36 PM: To address all issues (including breaking changes), run:
11:16:36 PM:   npm audit fix --force
11:16:36 PM: Run `npm audit` for details.
11:16:36 PM: NPM modules installed
11:16:36 PM: Started restoring cached go cache
11:16:36 PM: Finished restoring cached go cache
11:16:36 PM: go version go1.16.5 linux/amd64
11:16:36 PM: go version go1.16.5 linux/amd64
11:16:36 PM: Installing missing commands
11:16:36 PM: Verify run directory
11:16:37 PM: ​
11:16:37 PM: ────────────────────────────────────────────────────────────────
11:16:37 PM:   Netlify Build                                                 
11:16:37 PM: ────────────────────────────────────────────────────────────────
11:16:37 PM: ​
11:16:37 PM: ❯ Version
11:16:37 PM:   @netlify/build 26.5.0
11:16:37 PM: ​
11:16:37 PM: ❯ Flags
11:16:37 PM:   baseRelDir: true
11:16:37 PM:   buildId: 623656225fb5e90008b09652
11:16:37 PM:   deployId: 623656225fb5e90008b09654
11:16:37 PM: ​
11:16:37 PM: ❯ Current directory
11:16:37 PM:   /opt/build/repo
11:16:37 PM: ​
11:16:37 PM: ❯ Config file
11:16:37 PM:   No config file was defined: using default values.
11:16:37 PM: ​
11:16:37 PM: ❯ Context
11:16:37 PM:   production
11:16:37 PM: ​
11:16:37 PM: ❯ Loading plugins
11:16:37 PM:    - @netlify/plugin-gatsby@2.1.3 from Netlify app
11:16:38 PM: ​
11:16:38 PM: ────────────────────────────────────────────────────────────────
11:16:38 PM:   1. @netlify/plugin-gatsby (onPreBuild event)                  
11:16:38 PM: ────────────────────────────────────────────────────────────────
11:16:38 PM: ​
11:16:39 PM: Found a Gatsby cache. We’re about to go FAST. ⚡️
11:16:39 PM: public [
11:16:39 PM:   '231-c69ef49be5909550a544.js',
11:16:39 PM:   '231-c69ef49be5909550a544.js.map',
11:16:39 PM:   '404',
11:16:39 PM:   '404.html',
11:16:39 PM:   '610-65e6778b3e5dc0db76f2.js',
11:16:39 PM:   '610-65e6778b3e5dc0db76f2.js.map',
11:16:39 PM:   '898-bae251378bc670e914ff.js',
11:16:39 PM:   '898-bae251378bc670e914ff.js.map',
11:16:39 PM:   '_redirects',
11:16:39 PM:   'app-59d0ccd25414e7c4ba79.js',
11:16:39 PM:   'app-59d0ccd25414e7c4ba79.js.LICENSE.txt',
11:16:39 PM:   'app-59d0ccd25414e7c4ba79.js.map',
11:16:39 PM:   'app-8c156a308ad00943a017.js',
11:16:39 PM:   'app-8c156a308ad00943a017.js.LICENSE.txt',
11:16:39 PM:   'app-8c156a308ad00943a017.js.map',
11:16:39 PM:   'app-cbde57a6c47a65fed2c8.js',
11:16:39 PM:   'app-cbde57a6c47a65fed2c8.js.LICENSE.txt',
11:16:39 PM:   'app-cbde57a6c47a65fed2c8.js.map',
11:16:39 PM:   'app-d36c49028f5b11699edf.js',
11:16:39 PM:   'app-d36c49028f5b11699edf.js.LICENSE.txt',
11:16:39 PM:   'app-d36c49028f5b11699edf.js.map',
11:16:39 PM:   'chunk-map.json',
11:16:39 PM:   'component---src-pages-404-js-c3966c8f6427950253fa.js',
11:16:39 PM:   'component---src-pages-404-js-c3966c8f6427950253fa.js.map',
11:16:39 PM:   'component---src-pages-404-js-f484d90e5355e198f5d9.js',
11:16:39 PM:   'component---src-pages-404-js-f484d90e5355e198f5d9.js.map',
11:16:39 PM:   'component---src-pages-index-js-2815a23e94a8c1832b6f.js',
11:16:39 PM:   'component---src-pages-index-js-2815a23e94a8c1832b6f.js.map',
11:16:39 PM:   'component---src-pages-index-js-85166d97de33a038f892.js',
11:16:39 PM:   'component---src-pages-index-js-85166d97de33a038f892.js.map',
11:16:39 PM:   'component---src-pages-index-js-8d7b06b2d4a657fd4290.js',
11:16:39 PM:   'component---src-pages-index-js-8d7b06b2d4a657fd4290.js.LICENSE.txt',
11:16:39 PM:   'component---src-pages-index-js-8d7b06b2d4a657fd4290.js.map',
11:16:39 PM:   'component---src-pages-index-js-a4a7bb5eb9d68e7051b5.js',
11:16:39 PM:   'component---src-pages-index-js-a4a7bb5eb9d68e7051b5.js.LICENSE.txt',
11:16:39 PM:   'component---src-pages-index-js-a4a7bb5eb9d68e7051b5.js.map',
11:16:39 PM:   'component---src-pages-index-js-b63338532f4d3272abdf.js',
11:16:39 PM:   'component---src-pages-index-js-b63338532f4d3272abdf.js.LICENSE.txt',
11:16:39 PM:   'component---src-pages-index-js-b63338532f4d3272abdf.js.map',
11:16:39 PM:   'favicon-32x32.png',
11:16:39 PM:   'framework-96a0af67290665ca0e75.js',
11:16:39 PM:   'framework-96a0af67290665ca0e75.js.LICENSE.txt',
11:16:39 PM:   'framework-96a0af67290665ca0e75.js.map',
11:16:39 PM:   'icons',
11:16:39 PM:   'index.html',
11:16:39 PM:   'manifest.webmanifest',
11:16:39 PM:   'page-data',
11:16:39 PM:   'polyfill-80c24aab2da3deebaead.js',
11:16:39 PM:   'polyfill-80c24aab2da3deebaead.js.map',
11:16:39 PM:   'sitemap',
11:16:39 PM:   'static',
11:16:39 PM:   'webpack-runtime-130102dc45920916fb09.js',
11:16:39 PM:   'webpack-runtime-130102dc45920916fb09.js.map',
11:16:39 PM:   'webpack-runtime-734c022794e5a95657cd.js',
11:16:39 PM:   'webpack-runtime-734c022794e5a95657cd.js.map',
11:16:39 PM:   'webpack-runtime-74002c91ecc37974cc61.js',
11:16:39 PM:   'webpack-runtime-74002c91ecc37974cc61.js.map',
11:16:39 PM:   'webpack-runtime-b36a3daa16dca96f60ae.js',
11:16:39 PM:   'webpack-runtime-b36a3daa16dca96f60ae.js.map',
11:16:39 PM:   'webpack-runtime-bc2f751f5bfd10368ccb.js',
11:16:39 PM:   'webpack-runtime-bc2f751f5bfd10368ccb.js.map',
11:16:39 PM:   'webpack.stats.json'
11:16:39 PM: ]
11:16:39 PM: /opt/build/repo/.cache [
11:16:39 PM:   '_this_is_virtual_fs_path_',
11:16:39 PM:   'api-runner-browser-plugins.js',
11:16:39 PM:   'api-runner-browser.js',
11:16:39 PM:   'api-runner-ssr.js',
11:16:39 PM:   'api-ssr-docs.js',
11:16:39 PM:   'app.js',
11:16:39 PM:   'async-requires.js',
11:16:39 PM:   'babelState.json',
11:16:39 PM:   'blank.css',
11:16:39 PM:   'caches-lmdb',
11:16:39 PM:   'commonjs',
11:16:39 PM:   'css-to-object.js',
11:16:39 PM:   'data',
11:16:39 PM:   'debug-log.js',
11:16:39 PM:   'default-html.js',
11:16:39 PM:   'dev-loader.js',
11:16:39 PM:   'develop-static-entry.js',
11:16:39 PM:   'dummy.js',
11:16:39 PM:   'emitter.js',
11:16:39 PM:   'ensure-resources.js',
11:16:39 PM:   'error-overlay-handler.js',
11:16:39 PM:   'fast-refresh-overlay',
11:16:39 PM:   'find-path.js',
11:16:39 PM:   'functions',
11:16:39 PM:   'gatsby-browser-entry.js',
11:16:39 PM:   'loader.js',
11:16:39 PM:   'loading-indicator',
11:16:39 PM:   'match-paths.json',
11:16:39 PM:   'navigation.js',
11:16:39 PM:   'normalize-page-path.js',
11:16:39 PM:   'page-renderer.js',
11:16:39 PM:   'page-ssr',
11:16:39 PM:   'pages.json',
11:16:39 PM:   'polyfill-entry.js',
11:16:39 PM:   'prefetch.js',
11:16:39 PM:   'production-app.js',
11:16:39 PM:   'public-page-renderer-dev.js',
11:16:39 PM:   'public-page-renderer-prod.js',
11:16:39 PM:   'public-page-renderer.js',
11:16:39 PM:   'query-engine',
11:16:39 PM:   'query-result-store.js',
11:16:39 PM:   'react-lifecycles-compat.js',
11:16:39 PM:   'redirect-utils.js',
11:16:39 PM:   'redirects.json',
11:16:39 PM:   'redux',
11:16:39 PM:   'register-service-worker.js',
11:16:39 PM:   'root.js',
11:16:39 PM:   'route-announcer-props.js',
11:16:39 PM:   'schema.gql',
11:16:39 PM:   'server-utils',
11:16:39 PM:   'shadow-portal.js',
11:16:39 PM:   'socketIo.js',
11:16:39 PM:   'ssr-builtin-trackers',
11:16:39 PM:   'ssr-develop-static-entry.js',
11:16:39 PM:   'static-entry.js',
11:16:39 PM:   'strip-prefix.js',
11:16:39 PM:   'sync-requires.js',
11:16:39 PM:   'test-require-error.js',
11:16:39 PM:   'webpack',
11:16:39 PM:   'worker'
11:16:39 PM: ]
11:16:39 PM: ​
11:16:39 PM: (@netlify/plugin-gatsby onPreBuild completed in 384ms)
11:16:39 PM: ​
11:16:39 PM: ────────────────────────────────────────────────────────────────
11:16:39 PM:   2. Build command from Netlify app                             
11:16:39 PM: ────────────────────────────────────────────────────────────────
11:16:39 PM: ​
11:16:39 PM: $ gatsby build
11:16:41 PM: success compile gatsby files - 0.563s
11:16:41 PM: success load gatsby config - 0.036s
11:16:42 PM: success load plugins - 1.022s
11:16:42 PM: success onPreInit - 0.004s
11:16:42 PM: success delete worker cache from previous builds - 0.002s
11:16:42 PM: info One or more of your plugins have changed since the last time you ran Gatsby. As
11:16:42 PM: a precaution, we're deleting your site's cache to ensure there's no stale data.
success initialize cache - 0.080s
11:16:42 PM: success copy gatsby files - 0.116s
11:16:43 PM: success Compiling Gatsby Functions - 0.197s
11:16:43 PM: success onPreBootstrap - 0.214s
11:16:43 PM: success createSchemaCustomization - 0.049s
11:16:43 PM: success Checking for changed pages - 0.000s
11:16:43 PM: success source and transform nodes - 0.480s
11:16:44 PM: info Writing GraphQL type definitions to /opt/build/repo/.cache/schema.gql
11:16:44 PM: success building schema - 1.106s
11:16:44 PM: success createPages - 0.000s
11:16:45 PM: success createPagesStatefully - 0.207s
11:16:45 PM: info Total nodes: 69, SitePage nodes: 3 (use --verbose for breakdown)
11:16:45 PM: success Checking for changed pages - 0.000s
11:16:45 PM: success Cleaning up stale page-data - 0.001s
11:16:45 PM: success onPreExtractQueries - 0.000s
11:16:50 PM: error There was a problem parsing "/opt/build/repo/node_modules/gatsby-source-prismic/src/runtime/normalize.ts"; any GraphQL
11:16:50 PM: fragments or queries in this file were not processed.
11:16:50 PM: This may indicate a syntax error in the code, or it may be a file type
11:16:50 PM: that Gatsby does not know how to parse.
11:16:50 PM: error There was a problem parsing "/opt/build/repo/node_modules/gatsby-source-prismic/src/runtime/runtime.ts"; any GraphQL
11:16:50 PM: fragments or queries in this file were not processed.
11:16:50 PM: This may indicate a syntax error in the code, or it may be a file type
11:16:50 PM: that Gatsby does not know how to parse.
11:16:50 PM: error There was a problem parsing "/opt/build/repo/node_modules/@imgix/gatsby/src/modules/gatsby-plugin/createImgixGatsbyImageDataFieldConfig.ts"; any GraphQL
11:16:50 PM: fragments or queries in this file were not processed.
11:16:50 PM: This may indicate a syntax error in the code, or it may be a file type
11:16:50 PM: that Gatsby does not know how to parse.
11:16:50 PM: error There was a problem parsing "/opt/build/repo/node_modules/@imgix/gatsby/src/modules/gatsby-plugin/graphqlTypes.ts"; any GraphQL
11:16:50 PM: fragments or queries in this file were not processed.
11:16:50 PM: This may indicate a syntax error in the code, or it may be a file type
11:16:50 PM: that Gatsby does not know how to parse.
11:16:50 PM: error There was a problem parsing "/opt/build/repo/node_modules/@imgix/gatsby/src/modules/gatsby-plugin/typeBuilder.ts"; any GraphQL
11:16:50 PM: fragments or queries in this file were not processed.
11:16:50 PM: This may indicate a syntax error in the code, or it may be a file type
11:16:50 PM: that Gatsby does not know how to parse.
11:16:50 PM: error There was a problem parsing "/opt/build/repo/node_modules/@imgix/gatsby/src/modules/gatsby-transform-url/breakpoints.ts"; any GraphQL
11:16:50 PM: fragments or queries in this file were not processed.
11:16:50 PM: This may indicate a syntax error in the code, or it may be a file type
11:16:50 PM: that Gatsby does not know how to parse.
11:16:50 PM: failed extract queries from components - 5.758s
11:16:51 PM: ​
11:16:51 PM: ────────────────────────────────────────────────────────────────
11:16:51 PM:   "build.command" failed                                        
11:16:51 PM: ────────────────────────────────────────────────────────────────
11:16:51 PM: ​
11:16:51 PM:   Error message
11:16:51 PM:   Command failed with exit code 1: gatsby build (https://ntl.fyi/exit-code-1)
11:16:51 PM: Creating deploy upload records
11:16:51 PM: ​
11:16:51 PM:   Error location
11:16:51 PM:   In Build command from Netlify app:
11:16:51 PM:   gatsby build
11:16:51 PM: ​
11:16:51 PM:   Resolved config
11:16:52 PM: Failed during stage 'building site': Build script returned non-zero exit code: 2 (https://ntl.fyi/exit-code-2)
11:16:51 PM:   build:
11:16:51 PM:     command: gatsby build
11:16:51 PM:     commandOrigin: ui
11:16:51 PM:     environment:
11:16:51 PM:       - GATSBY_PRISMIC_REPO_NAME
11:16:51 PM:       - PRISMIC_ACCESS_TOKEN
11:16:51 PM:     publish: /opt/build/repo/public
11:16:51 PM:     publishOrigin: ui
11:16:51 PM:   plugins:
11:16:51 PM:     - inputs: {}
11:16:51 PM:       origin: ui
11:16:51 PM:       package: '@netlify/plugin-gatsby'
11:16:51 PM:   redirects:
11:16:51 PM:     - from: /api/*
      status: 200
      to: /.netlify/functions/__api
Caching artifacts
11:16:51 PM: Started saving node modules
11:16:51 PM: Finished saving node modules
11:16:51 PM: Started saving build plugins
11:16:51 PM: Finished saving build plugins
11:16:51 PM: Started saving pip cache
11:16:51 PM: Finished saving pip cache
11:16:51 PM: Started saving emacs cask dependencies
11:16:51 PM: Finished saving emacs cask dependencies
11:16:51 PM: Started saving maven dependencies
11:16:51 PM: Finished saving maven dependencies
11:16:51 PM: Started saving boot dependencies
11:16:51 PM: Finished saving boot dependencies
11:16:51 PM: Started saving rust rustup cache
11:16:51 PM: Finished saving rust rustup cache
11:16:51 PM: Started saving go dependencies
11:16:51 PM: Finished saving go dependencies
11:16:51 PM: Build failed due to a user error: Build script returned non-zero exit code: 2
11:16:52 PM: Failing build: Failed to build site
11:16:52 PM: Finished processing build request in 48.024683254s

Are you sure everything is correct? Does this help?