My app is not deploying eager-goldstine-ef0bff

I pushed my portfolio app code in Github and trying to deploy it on netlify. But some cause the failure in the deployment and I am not getting the fail point. kindly help me thanks in advance

@Ali_shah Please help us help you by writing a good post!

All issues: Provide your Netlify site name (e.g. gifted-antelope-58b104.netlify.app).

DNS or SSL issues: Tell us your custom domain(s) (e.g. mycustomdomain.com), and how long it has been since you made changes to your DNS (DNS changes can take up to 48 hours). We can’t help if we don’t know your domain.

Build issues: Tell us about your workflow, including what SSG you are using.

If you are deploying via git, give us the URL of the repository.

Let us know what you have already tried and what the results were.

The better the post = the faster we can help!

1 Like

Site name : eager-goldstine-ef0bff
Domain Name : [eager-goldstine-ef0bff.netlify.app] (https://eager-goldstine-ef0bff.netlify.app/)
git repository : [github.com/6605295/portfolio] (https://github.com/6605295/portfolio)

4:02:39 AM: Build ready to start
4:02:40 AM: build-image version: 7b53c5fc4445e3ec99d3949e5d1174a8c5be4f16
4:02:40 AM: build-image tag: v3.7.2
4:02:40 AM: buildbot version: a8df6d1263bb5bcc16f7b4ebb8e9a6cb904cfa8a
4:02:41 AM: Fetching cached dependencies
4:02:41 AM: Failed to fetch cache, continuing with build
4:02:41 AM: Starting to prepare the repo for build
4:02:41 AM: No cached dependencies found. Cloning fresh repo
4:02:41 AM: git clone https://github.com/6605295/portfolio
4:02:43 AM: Preparing Git Reference refs/heads/main
4:02:45 AM: Parsing package.json dependencies
4:02:46 AM: Starting build script
4:02:46 AM: Installing dependencies
4:02:46 AM: Python version set to 2.7
4:02:47 AM: v12.18.0 is already installed.
4:02:47 AM: Now using node v12.18.0 (npm v6.14.4)
4:02:48 AM: Started restoring cached build plugins
4:02:48 AM: Finished restoring cached build plugins
4:02:48 AM: Attempting ruby version 2.7.1, read from environment
4:02:49 AM: Using ruby version 2.7.1
4:02:49 AM: Using PHP version 5.6
4:02:49 AM: Started restoring cached node modules
4:02:49 AM: Finished restoring cached node modules
4:02:50 AM: Installing NPM modules using NPM version 6.14.4
4:03:26 AM: npm WARN read-shrinkwrap This version of npm is compatible with lockfileVersion@1, but package-lock.json was generated for lockfileVersion@2. I’ll try to do my best with it!
4:03:26 AM: > tsparticles@1.26.3 install /opt/build/repo/node_modules/tsparticles
4:03:26 AM: > node ./scripts/install.js
4:03:26 AM: Thank you for installing tsParticles.
4:03:26 AM: Remember to checkout the official website https://particles.js.org to explore some samples.
4:03:26 AM: You can find more samples on CodePen too: https://codepen.io/collection/DPOage
4:03:26 AM: If you need documentation you can find it here: https://particles.js.org
4:03:26 AM: Remember to leave a star on the tsParticles repository if you like the project and want to support it: GitHub - matteobruni/tsparticles: tsParticles - Easily create highly customizable particles animations and use them as animated backgrounds for your website. Ready to use components available for React, Vue.js (2.x and 3.x), Angular, Svelte, jQuery, Preact, Inferno.
4:03:26 AM: Found React installed. Please download react-tsparticles to use tsParticles with a component ready to use and easier to configure.
4:03:26 AM: You can read more about the component here: tsparticles/README.md at main · matteobruni/tsparticles · GitHub
4:03:27 AM: > @fortawesome/fontawesome-common-types@0.2.35 postinstall /opt/build/repo/node_modules/@fortawesome/fontawesome-common-types
4:03:27 AM: > node attribution.js
4:03:27 AM: Font Awesome Free 0.2.35 by @fontawesome - https://fontawesome.com
4:03:27 AM: License - Font Awesome (Icons: CC BY 4.0, Fonts: SIL OFL 1.1, Code: MIT License)
4:03:27 AM: > core-js@2.6.12 postinstall /opt/build/repo/node_modules/babel-runtime/node_modules/core-js
4:03:27 AM: > node -e “try{require(’./postinstall’)}catch(e){}”
4:03:27 AM: > core-js@3.8.2 postinstall /opt/build/repo/node_modules/core-js
4:03:27 AM: > node -e “try{require(’./postinstall’)}catch(e){}”
4:03:27 AM: > core-js-pure@3.8.2 postinstall /opt/build/repo/node_modules/core-js-pure
4:03:27 AM: > node -e “try{require(’./postinstall’)}catch(e){}”
4:03:27 AM: > ejs@2.7.4 postinstall /opt/build/repo/node_modules/ejs
4:03:27 AM: > node ./postinstall.js
4:03:28 AM: > @fortawesome/fontawesome-svg-core@1.2.35 postinstall /opt/build/repo/node_modules/@fortawesome/fontawesome-svg-core
4:03:28 AM: > node attribution.js
4:03:28 AM: Font Awesome Free 1.2.35 by @fontawesome - https://fontawesome.com
4:03:28 AM: License - Font Awesome (Icons: CC BY 4.0, Fonts: SIL OFL 1.1, Code: MIT License)
4:03:28 AM: > @fortawesome/free-solid-svg-icons@5.15.3 postinstall /opt/build/repo/node_modules/@fortawesome/free-solid-svg-icons
4:03:28 AM: > node attribution.js
4:03:28 AM: Font Awesome Free 5.15.3 by @fontawesome - https://fontawesome.com
4:03:28 AM: License - Font Awesome (Icons: CC BY 4.0, Fonts: SIL OFL 1.1, Code: MIT License)
4:03:28 AM: > react-vertical-timeline-component@3.3.3 postinstall /opt/build/repo/node_modules/react-vertical-timeline-component
4:03:28 AM: > node lib/post_install.js
4:03:30 AM: npm WARN optional SKIPPING OPTIONAL DEPENDENCY: fsevents@1.2.13 (node_modules/webpack-dev-server/node_modules/fsevents):
4:03:30 AM: npm WARN notsup SKIPPING OPTIONAL DEPENDENCY: Unsupported platform for fsevents@1.2.13: wanted {“os”:“darwin”,“arch”:“any”} (current: {“os”:“linux”,“arch”:“x64”})
4:03:30 AM: npm WARN optional SKIPPING OPTIONAL DEPENDENCY: fsevents@1.2.13 (node_modules/watchpack-chokidar2/node_modules/fsevents):
4:03:30 AM: npm WARN notsup SKIPPING OPTIONAL DEPENDENCY: Unsupported platform for fsevents@1.2.13: wanted {“os”:“darwin”,“arch”:“any”} (current: {“os”:“linux”,“arch”:“x64”})
4:03:30 AM: npm WARN optional SKIPPING OPTIONAL DEPENDENCY: fsevents@2.3.1 (node_modules/fsevents):
4:03:30 AM: npm WARN notsup SKIPPING OPTIONAL DEPENDENCY: Unsupported platform for fsevents@2.3.1: wanted {“os”:“darwin”,“arch”:“any”} (current: {“os”:“linux”,“arch”:“x64”})
4:03:30 AM: added 1994 packages from 988 contributors and audited 2000 packages in 39.97s
4:03:32 AM: 129 packages are looking for funding
4:03:32 AM: run npm fund for details
4:03:32 AM: found 5 vulnerabilities (4 moderate, 1 high)
4:03:32 AM: run npm audit fix to fix them, or npm audit for details
4:03:32 AM: NPM modules installed
4:03:32 AM: Started restoring cached go cache
4:03:32 AM: Finished restoring cached go cache
4:03:32 AM: go version go1.14.4 linux/amd64
4:03:32 AM: go version go1.14.4 linux/amd64
4:03:32 AM: Installing missing commands
4:03:32 AM: Verify run directory
4:03:34 AM: ​
4:03:34 AM: ────────────────────────────────────────────────────────────────
4:03:34 AM: Netlify Build
4:03:34 AM: ────────────────────────────────────────────────────────────────
4:03:34 AM: ​
4:03:34 AM: ❯ Version
4:03:34 AM: @netlify/build 11.3.2
4:03:34 AM: ​
4:03:34 AM: ❯ Flags
4:03:34 AM: deployId: 6089e98e63905e00ac1d19d8
4:03:34 AM: ​
4:03:34 AM: ❯ Current directory
4:03:34 AM: /opt/build/repo
4:03:34 AM: ​
4:03:34 AM: ❯ Config file
4:03:34 AM: No config file was defined: using default values.
4:03:34 AM: ​
4:03:34 AM: ❯ Context
4:03:34 AM: production
4:03:34 AM: ​
4:03:34 AM: ────────────────────────────────────────────────────────────────
4:03:34 AM: 1. Build command from Netlify app
4:03:34 AM: ────────────────────────────────────────────────────────────────
4:03:34 AM: ​
4:03:34 AM: $ npm run build
4:03:34 AM: > resume_starter_pack@0.1.0 build /opt/build/repo
4:03:34 AM: > react-scripts build
4:03:36 AM: Creating an optimized production build…
4:04:07 AM:
4:04:07 AM: Treating warnings as errors because process.env.CI = true.
4:04:07 AM: Most CI servers set it automatically.
4:04:07 AM:
4:04:07 AM: Failed to compile.
4:04:07 AM:
4:04:07 AM: src/App.js
4:04:07 AM: Line 6:8: ‘Contact’ is defined but never used no-unused-vars
4:04:07 AM: Line 7:8: ‘Testimonials’ is defined but never used no-unused-vars
4:04:07 AM: Line 18:10: ‘resumeData’ is assigned a value but never used no-unused-vars
4:04:07 AM: src/component/About.js
4:04:07 AM: Line 2:8: ‘main’ is defined but never used no-unused-vars
4:04:07 AM: Line 9:20: ‘setSkills’ is assigned a value but never used no-unused-vars
4:04:07 AM: Line 17:21: img elements must have an alt prop, either with meaningful text, or an empty string for decorative images jsx-a11y/alt-text
4:04:07 AM: src/component/Header.js
4:04:07 AM: Line 4:8: ‘main’ is defined but never used no-unused-vars
4:04:07 AM: Line 5:8: ‘Ali’ is defined but never used no-unused-vars
4:04:07 AM: Line 43:21: img elements must have an alt prop, either with meaningful text, or an empty string for decorative images jsx-a11y/alt-text
4:04:07 AM: Line 57:21: img elements must have an alt prop, either with meaningful text, or an empty string for decorative images jsx-a11y/alt-text
4:04:07 AM: src/component/Portfolio.js
4:04:07 AM: Line 7:8: ‘aquada_1’ is defined but never used no-unused-vars
4:04:07 AM: Line 8:8: ‘aquada_2’ is defined but never used no-unused-vars
4:04:07 AM: Line 9:8: ‘aquada_3’ is defined but never used no-unused-vars
4:04:07 AM: Line 10:8: ‘aquada_4’ is defined but never used no-unused-vars
4:04:07 AM: Line 11:8: ‘aquada_5’ is defined but never used no-unused-vars
4:04:07 AM: Line 12:8: ‘aquada_6’ is defined but never used no-unused-vars
4:04:07 AM: Line 13:8: ‘aquada_7’ is defined but never used no-unused-vars
4:04:07 AM: Line 14:8: ‘aquada_8’ is defined but never used no-unused-vars
4:04:07 AM: Line 15:8: ‘aquada_9’ is defined but never used no-unused-vars
4:04:07 AM: Line 16:8: ‘aquada_10’ is defined but never used no-unused-vars
4:04:07 AM: Line 17:8: ‘aquada_11’ is defined but never used no-unused-vars
4:04:07 AM: Line 18:8: ‘aquada_12’ is defined but never used no-unused-vars
4:04:07 AM: Line 23:8: ‘etisalat_1’ is defined but never used no-unused-vars
4:04:07 AM: Line 24:8: ‘etisalat_2’ is defined but never used no-unused-vars
4:04:07 AM: Line 25:8: ‘etisalat_3’ is defined but never used no-unused-vars
4:04:07 AM: Line 26:8: ‘etisalat_4’ is defined but never used no-unused-vars
4:04:07 AM: Line 27:8: ‘etisalat_5’ is defined but never used no-unused-vars
4:04:07 AM: Line 38:8: ‘medi_1’ is defined but never used no-unused-vars
4:04:07 AM: Line 39:8: ‘medi_2’ is defined but never used no-unused-vars
4:04:07 AM: Line 40:8: ‘medi_3’ is defined but never used no-unused-vars
4:04:07 AM: Line 41:8: ‘medi_4’ is defined but never used no-unused-vars
4:04:07 AM: Line 42:8: ‘medi_5’ is defined but never used no-unused-vars
4:04:07 AM: Line 43:8: ‘medi_6’ is defined but never used no-unused-vars
4:04:07 AM: Line 44:8: ‘medi_7’ is defined but never used no-unused-vars
4:04:07 AM: Line 45:8: ‘medi_8’ is defined but never used no-unused-vars
4:04:07 AM: Line 46:8: ‘medi_9’ is defined but never used no-unused-vars
4:04:07 AM: Line 47:8: ‘medi_10’ is defined but never used no-unused-vars
4:04:07 AM: Line 48:8: ‘medi_11’ is defined but never used no-unused-vars
4:04:07 AM: Line 51:8: ‘ordering_1’ is defined but never used no-unused-vars
4:04:07 AM: Line 52:8: ‘ordering_2’ is defined but never used no-unused-vars
4:04:07 AM: Line 53:8: ‘ordering_3’ is defined but never used no-unused-vars
4:04:07 AM: Line 54:8: ‘ordering_4’ is defined but never used no-unused-vars
4:04:07 AM: Line 55:8: ‘ordering_5’ is defined but never used no-unused-vars
4:04:07 AM: Line 56:8: ‘ordering_6’ is defined but never used no-unused-vars
4:04:07 AM: Line 59:8: ‘eventFusion_1’ is defined but never used no-unused-vars
4:04:07 AM: Line 60:8: ‘eventFusion_2’ is defined but never used no-unused-vars
4:04:07 AM: Line 61:8: ‘eventFusion_3’ is defined but never used no-unused-vars
4:04:07 AM: Line 62:8: ‘eventFusion_4’ is defined but never used no-unused-vars
4:04:07 AM: Line 63:8: ‘eventFusion_5’ is defined but never used no-unused-vars
4:04:07 AM: Line 64:8: ‘eventFusion_6’ is defined but never used no-unused-vars
4:04:07 AM: Line 70:8: ‘health_main’ is defined but never used no-unused-vars
4:04:07 AM: Line 71:8: ‘health_1’ is defined but never used no-unused-vars
4:04:07 AM: Line 72:8: ‘health_2’ is defined but never used no-unused-vars
4:04:07 AM: Line 73:8: ‘health_3’ is defined but never used no-unused-vars
4:04:07 AM: Line 74:8: ‘health_4’ is defined but never used no-unused-vars
4:04:07 AM: Line 75:8: ‘health_5’ is defined but never used no-unused-vars
4:04:07 AM: Line 77:8: ‘movieStore_main’ is defined but never used no-unused-vars
4:04:07 AM: Line 82:8: ‘uskt_1’ is defined but never used no-unused-vars
4:04:07 AM: Line 83:8: ‘uskt_2’ is defined but never used no-unused-vars
4:04:07 AM: Line 84:8: ‘uskt_3’ is defined but never used no-unused-vars
4:04:07 AM: Line 85:8: ‘uskt_4’ is defined but never used no-unused-vars
4:04:07 AM: Line 86:8: ‘uskt_5’ is defined but never used no-unused-vars
4:04:07 AM: Line 87:8: ‘uskt_6’ is defined but never used no-unused-vars
4:04:07 AM: Line 88:8: ‘uskt_7’ is defined but never used no-unused-vars
4:04:07 AM: Line 91:8: ‘yamani_1’ is defined but never used no-unused-vars
4:04:07 AM: Line 92:8: ‘yamani_2’ is defined but never used no-unused-vars
4:04:07 AM: Line 93:8: ‘yamani_3’ is defined but never used no-unused-vars
4:04:07 AM: Line 94:8: ‘yamani_4’ is defined but never used no-unused-vars
4:04:07 AM: Line 95:8: ‘yamani_5’ is defined but never used no-unused-vars
4:04:07 AM: Line 318:57: Redundant alt attribute. Screen-readers already announce img tags as an image. You don’t need to use the words image, photo, or picture (or any specified custom words) in the alt prop jsx-a11y/img-redundant-alt
4:04:07 AM: Line 338:57: Redundant alt attribute. Screen-readers already announce img tags as an image. You don’t need to use the words image, photo, or picture (or any specified custom words) in the alt prop jsx-a11y/img-redundant-alt
4:04:07 AM: Line 357:57: Redundant alt attribute. Screen-readers already announce img tags as an image. You don’t need to use the words image, photo, or picture (or any specified custom words) in the alt prop jsx-a11y/img-redundant-alt
4:04:07 AM: Line 376:57: Redundant alt attribute. Screen-readers already announce img tags as an image. You don’t need to use the words image, photo, or picture (or any specified custom words) in the alt prop jsx-a11y/img-redundant-alt
4:04:07 AM: src/component/Resume.js
4:04:07 AM: Line 10:28: ‘setexperienceData’ is assigned a value but never used no-unused-vars
4:04:07 AM: Line 30:27: ‘setEducationData’ is assigned a value but never used no-unused-vars
4:04:07 AM: npm ERR! code ELIFECYCLE
4:04:07 AM: npm ERR! errno 1
4:04:07 AM: npm ERR! resume_starter_pack@0.1.0 build: react-scripts build
4:04:07 AM: npm ERR! Exit status 1
4:04:07 AM: npm ERR!
4:04:07 AM: npm ERR! Failed at the resume_starter_pack@0.1.0 build script.
4:04:07 AM: npm ERR! This is probably not a problem with npm. There is likely additional logging output above.
4:04:07 AM: npm ERR! A complete log of this run can be found in:
4:04:07 AM: npm ERR! /opt/buildhome/.npm/_logs/2021-04-28T23_04_07_790Z-debug.log
4:04:07 AM: ​
4:04:07 AM: ────────────────────────────────────────────────────────────────
4:04:07 AM: “build.command” failed
4:04:07 AM: ────────────────────────────────────────────────────────────────
4:04:07 AM: ​
4:04:07 AM: Error message
4:04:07 AM: Command failed with exit code 1: npm run build
4:04:07 AM: ​
4:04:07 AM: Error location
4:04:07 AM: In Build command from Netlify app:
4:04:07 AM: npm run build
4:04:07 AM: ​
4:04:07 AM: Resolved config
4:04:07 AM: build:
4:04:07 AM: command: npm run build
4:04:07 AM: commandOrigin: ui
4:04:07 AM: publish: /opt/build/repo/build
4:04:08 AM: Caching artifacts
4:04:08 AM: Started saving node modules
4:04:08 AM: Finished saving node modules
4:04:08 AM: Started saving build plugins
4:04:08 AM: Finished saving build plugins
4:04:08 AM: Started saving pip cache
4:04:08 AM: Finished saving pip cache
4:04:08 AM: Started saving emacs cask dependencies
4:04:08 AM: Finished saving emacs cask dependencies
4:04:08 AM: Started saving maven dependencies
4:04:08 AM: Finished saving maven dependencies
4:04:08 AM: Started saving boot dependencies
4:04:08 AM: Finished saving boot dependencies
4:04:08 AM: Started saving rust rustup cache
4:04:08 AM: Finished saving rust rustup cache
4:04:08 AM: Started saving go dependencies
4:04:08 AM: Finished saving go dependencies
4:04:10 AM: Build failed due to a user error: Build script returned non-zero exit code: 2
4:04:10 AM: Creating deploy upload records
4:04:10 AM: Failing build: Failed to build site
4:04:10 AM: Failed during stage ‘building site’: Build script returned non-zero exit code: 2
4:04:10 AM: Finished processing build request in 1m29.936539941s

This looks to be a duplicate of your other post:

sorry i deleted that project and tried to deploy again and face same problem that’s why i posted again.

Thanks for bringing that up, @gregraven !

@Ali_shah, have you followed the same suggestions @hrishikesh made in your last thread? In the future, if you are facing the same issue in a short span of time, you can continue responding on your previous thread with an updated Netlify site name :slight_smile: